{"text_format":"1","workbook":"xlsx","n_sheets":8,"sheets":["IQEF Intake Form","MeasureCode","Paste Values","Copy Values","Project Performance","Module1","Module2","Module3"],"not_rendered":{"charts":0,"images":2,"macros":1,"external_links":0,"defined_names":87,"comments":1,"pivot_tables":0},"unopened":[{"sheet":"Module1","index":5,"reason":"part_missing"},{"sheet":"Module2","index":6,"reason":"part_missing"},{"sheet":"Module3","index":7,"reason":"part_missing"}],"bounds":{"document_bytes":16777216,"sheet_cells":100000,"rows_first":2000,"rows_last":500,"rows_between":2000,"halvings":0,"cell_chars":16384,"cell_head_chars":4096},"cells_cut":0,"cells_raw":0,"read":"whole","date_system":"1900"}

{"sheet":"IQEF Intake Form","index":0,"n_rows":106,"n_cols":23,"rows_kept":106,"cut":false,"hidden":false,"merged":[[2,8,2,9],[0,8,0,9],[1,8,1,9]]}
[null,null,null,null,null,null,null,null,"TOTAL PROJECT COST W/O CUSTOMER CONTRIBUTION",null,0]
[null,null,null,null,null,null,null,null,"CUSTOMER CONTRIBUTION",null,0]
[null,null,null,null,null,"Project Site  Address:",null,null,"TOTAL PROJECT COST",null,{"$f":"K1-K2","v":0},null,null,null,null,null,null,null,null,null,null,null,{"$f":"SUM(SUMPRODUCT(Q7:Q26,M7:M26),SUMPRODUCT(N29:N33,L29:L33),SUMPRODUCT(R36:R38,M36:M38),PRODUCT(M41,I41),PRODUCT(P44,J44),SUMPRODUCT(Q48:Q50,O48:O50),SUMPRODUCT(N54:N56,I54:I56),PRODUCT(K59,I59),SUMPRODUCT(N64:N66,J64:J66),SUMPRODUCT(L70:L73,I70:I73),L76:L77,SUMPRODUCT(K81:K86,H81:H86),SUMPRODUCT(J91:J93,G91:G93),SUMPRODUCT(L98:L99,J98:J99))","v":0}]
[null,null,null,null,null,"This form must be submitted along with the Income Qualified Efficiency Fund Application, to  include corresponding specification sheets for the measures listed in this form. "]
[null,null,null,null,null,"Lighting",null,{"$f":"VLOOKUP(K5, lighthrdef, 3, FALSE)","v":{"$error":"#N/A"}},"Existing Watts per Fixture (W)","Proposed Watts per Fixture (W)","Location","Existing Quantity","Proposed Quantity","Existing Equipment Age","Space Conditioning","Total Installed Cost","Materials Cost (per Bulb or Fixture)","Manufacturer","Model","Existing Lamp Description"]
[{"$f":"'Copy Values'!A4","v":"kWh"},{"$f":"'Copy Values'!B4","v":"kW"},{"$f":"'Copy Values'!D4","v":"MMBtu"},"Equivalent MMBtu",null,"Bulbs and Fixtures",null,null,null,null,1]
[{"$f":"'Copy Values'!A5","v":0},{"$f":"'Copy Values'!B5","v":0},{"$f":"'Copy Values'!D5","v":0},{"$f":"SUM(C7,(A7*3412.14/10^6))","v":0},null,null,null,{"$f":"VLOOKUP(K7, lighthrdef, 3, FALSE)","v":"Choose Location"},null,null,1,null,null,null,null,{"$f":"Q7/matcost*projcost","v":{"$error":"#DIV/0!"}},0]
[{"$f":"'Copy Values'!A6","v":0},{"$f":"'Copy Values'!B6","v":0},{"$f":"'Copy Values'!D6","v":0},{"$f":"SUM(C8,(A8*3412.14/10^6))","v":0},null,null,null,"Choose Location",null,null,1,null,null,null,null,{"$f":"Q8/matcost*projcost","v":{"$error":"#DIV/0!"}}]
[{"$f":"'Copy Values'!A7","v":0},{"$f":"'Copy Values'!B7","v":0},{"$f":"'Copy Values'!D7","v":0},0,null,null,null,"Choose Location",null,null,1,null,null,null,null,{"$f":"Q9/matcost*projcost","v":{"$error":"#DIV/0!"}}]
[{"$f":"'Copy Values'!A8","v":0},{"$f":"'Copy Values'!B8","v":0},{"$f":"'Copy Values'!D8","v":0},0,null,null,null,"Choose Location",null,null,1,null,null,null,null,{"$error":"#DIV/0!"}]
{"$rows_left_out":97}
{"sheet":"MeasureCode","index":1,"n_rows":77,"n_cols":12,"rows_kept":77,"cut":false,"hidden":true,"merged":[]}
["Air Conditioning Efficiency","Water chilling system",null,null,null,99,null,"Jan",null,1,"Select","Choose Location"]
["Air Conditioning Efficiency","AC, Cool Choice tier 2 0-65 KBTU/hr",null,null,null,98,null,"Feb",null,2,"In Unit",1150]
["Air Conditioning Efficiency","Heat pump, air, Cool Choice tier 2 0-65 KBTU/hr",null,null,"Energy Star/CEE Tier 1",97,null,"Mar",null,3,"Common Area - Indoor Hall/Stairway/Corridor",8760]
["Air Conditioning Efficiency","Heat pump, air source",null,null,"CEE Tier 2",96,null,"Apr",null,4,"Common Area - Laundry/Other",5950]
["Air Conditioning Efficiency","Unitary air conditioning system",null,null,"CEE Tier 3",95,null,"May",null,5,"Outdoor",4380]
["Air Conditioning Efficiency","Ductless Mini Split",null,null,null,94,null,"Jun",null,6,"Other","Specify"]
["Air Conditioning Efficiency","Package terminal heat hump",null,null,null,93,null,"Jul"]
["Air Conditioning Efficiency","Energy Star CEE Tier 1 AC, incremental",null,null,null,92,null,"Aug"]
["Cooking and Laundry","Energy Star dishwasher",null,null,null,91,null,"Sep"]
["Hot Water Efficiency","Low flow showerhead",null,null,null,90,null,"Oct"]
{"$rows_left_out":68}
{"sheet":"Paste Values","index":2,"n_rows":126,"n_cols":18,"rows_kept":126,"cut":false,"hidden":true,"merged":[]}
[{"$f":"VALUE('IQEF Intake Form'!F3)","v":{"$error":"#VALUE!"}},{"$f":"VALUE('IQEF Intake Form'!G3)","v":0},{"$f":"VALUE('IQEF Intake Form'!H3)","v":0},{"$f":"VALUE('IQEF Intake Form'!I3)","v":{"$error":"#VALUE!"}},{"$f":"VALUE('IQEF Intake Form'!J3)","v":0},{"$f":"VALUE('IQEF Intake Form'!K3)","v":0},{"$f":"VALUE('IQEF Intake Form'!L3)","v":0},{"$f":"VALUE('IQEF Intake Form'!M3)","v":0},{"$f":"VALUE('IQEF Intake Form'!N3)","v":0},{"$f":"VALUE('IQEF Intake Form'!O3)","v":0},{"$f":"VALUE('IQEF Intake Form'!P3)","v":0},{"$f":"VALUE('IQEF Intake Form'!Q3)","v":0},{"$f":"VALUE('IQEF Intake Form'!R3)","v":0},{"$f":"VALUE('IQEF Intake Form'!S3)","v":0},{"$f":"VALUE('IQEF Intake Form'!T3)","v":0},{"$f":"VALUE('IQEF Intake Form'!U3)","v":0},{"$f":"VALUE('IQEF Intake Form'!V3)","v":0},{"$f":"VALUE('IQEF Intake Form'!W3)","v":0}]
[{"$f":"VALUE('IQEF Intake Form'!F4)","v":{"$error":"#VALUE!"}},{"$f":"VALUE('IQEF Intake Form'!G4)","v":0},{"$f":"VALUE('IQEF Intake Form'!H4)","v":0},{"$f":"VALUE('IQEF Intake Form'!I4)","v":0},{"$f":"VALUE('IQEF Intake Form'!J4)","v":0},{"$f":"VALUE('IQEF Intake Form'!K4)","v":0},{"$f":"VALUE('IQEF Intake Form'!L4)","v":0},{"$f":"VALUE('IQEF Intake Form'!M4)","v":0},{"$f":"VALUE('IQEF Intake Form'!N4)","v":0},{"$f":"VALUE('IQEF Intake Form'!O4)","v":0},{"$f":"VALUE('IQEF Intake Form'!P4)","v":0},{"$f":"VALUE('IQEF Intake Form'!Q4)","v":0},{"$f":"VALUE('IQEF Intake Form'!R4)","v":0},{"$f":"VALUE('IQEF Intake Form'!S4)","v":0},{"$f":"VALUE('IQEF Intake Form'!T4)","v":0},{"$f":"VALUE('IQEF Intake Form'!U4)","v":0},{"$f":"VALUE('IQEF Intake Form'!V4)","v":0},{"$f":"VALUE('IQEF Intake Form'!W4)","v":0}]
[{"$f":"VALUE('IQEF Intake Form'!F5)","v":{"$error":"#VALUE!"}},{"$f":"VALUE('IQEF Intake Form'!G5)","v":0},{"$f":"VALUE('IQEF Intake Form'!H5)","v":{"$error":"#N/A"}},{"$f":"VALUE('IQEF Intake Form'!I5)","v":{"$error":"#VALUE!"}},{"$f":"VALUE('IQEF Intake Form'!J5)","v":{"$error":"#VALUE!"}},{"$f":"VALUE('IQEF Intake Form'!K5)","v":{"$error":"#VALUE!"}},{"$f":"VALUE('IQEF Intake Form'!L5)","v":{"$error":"#VALUE!"}},{"$f":"VALUE('IQEF Intake Form'!M5)","v":{"$error":"#VALUE!"}},{"$f":"VALUE('IQEF Intake Form'!N5)","v":{"$error":"#VALUE!"}},{"$f":"VALUE('IQEF Intake Form'!O5)","v":{"$error":"#VALUE!"}},{"$f":"VALUE('IQEF Intake Form'!P5)","v":{"$error":"#VALUE!"}},{"$f":"VALUE('IQEF Intake Form'!Q5)","v":{"$error":"#VALUE!"}},{"$f":"VALUE('IQEF Intake Form'!R5)","v":{"$error":"#VALUE!"}},{"$f":"VALUE('IQEF Intake Form'!S5)","v":{"$error":"#VALUE!"}},{"$f":"VALUE('IQEF Intake Form'!T5)","v":{"$error":"#VALUE!"}},{"$f":"VALUE('IQEF Intake Form'!U5)","v":0},{"$f":"VALUE('IQEF Intake Form'!V5)","v":0},{"$f":"VALUE('IQEF Intake Form'!W5)","v":0}]
[{"$f":"VALUE('IQEF Intake Form'!F6)","v":{"$error":"#VALUE!"}},{"$f":"VALUE('IQEF Intake Form'!G6)","v":0},{"$f":"VALUE('IQEF Intake Form'!H6)","v":0},{"$f":"VALUE('IQEF Intake Form'!I6)","v":0},{"$f":"VALUE('IQEF Intake Form'!J6)","v":0},{"$f":"VALUE('IQEF Intake Form'!K6)","v":1},{"$f":"VALUE('IQEF Intake Form'!L6)","v":0},{"$f":"VALUE('IQEF Intake Form'!M6)","v":0},{"$f":"VALUE('IQEF Intake Form'!N6)","v":0},{"$f":"VALUE('IQEF Intake Form'!O6)","v":0},{"$f":"VALUE('IQEF Intake Form'!P6)","v":0},{"$f":"VALUE('IQEF Intake Form'!Q6)","v":0},{"$f":"VALUE('IQEF Intake Form'!R6)","v":0},{"$f":"VALUE('IQEF Intake Form'!S6)","v":0},{"$f":"VALUE('IQEF Intake Form'!T6)","v":0},{"$f":"VALUE('IQEF Intake Form'!U6)","v":0},{"$f":"VALUE('IQEF Intake Form'!V6)","v":0},{"$f":"VALUE('IQEF Intake Form'!W6)","v":0}]
[{"$f":"VALUE('IQEF Intake Form'!F7)","v":0},{"$f":"VALUE('IQEF Intake Form'!G7)","v":0},{"$f":"VALUE('IQEF Intake Form'!H7)","v":{"$error":"#VALUE!"}},{"$f":"VALUE('IQEF Intake Form'!I7)","v":0},{"$f":"VALUE('IQEF Intake Form'!J7)","v":0},{"$f":"VALUE('IQEF Intake Form'!K7)","v":1},{"$f":"VALUE('IQEF Intake Form'!L7)","v":0},{"$f":"VALUE('IQEF Intake Form'!M7)","v":0},{"$f":"VALUE('IQEF Intake Form'!N7)","v":0},{"$f":"VALUE('IQEF Intake Form'!O7)","v":0},{"$f":"VALUE('IQEF Intake Form'!P7)","v":{"$error":"#DIV/0!"}},{"$f":"VALUE('IQEF Intake Form'!Q7)","v":0},{"$f":"VALUE('IQEF Intake Form'!R7)","v":0},{"$f":"VALUE('IQEF Intake Form'!S7)","v":0},{"$f":"VALUE('IQEF Intake Form'!T7)","v":0},{"$f":"VALUE('IQEF Intake Form'!U7)","v":0},{"$f":"VALUE('IQEF Intake Form'!V7)","v":0},{"$f":"VALUE('IQEF Intake Form'!W7)","v":0}]
[{"$f":"VALUE('IQEF Intake Form'!F8)","v":0},{"$f":"VALUE('IQEF Intake Form'!G8)","v":0},{"$f":"VALUE('IQEF Intake Form'!H8)","v":{"$error":"#VALUE!"}},{"$f":"VALUE('IQEF Intake Form'!I8)","v":0},{"$f":"VALUE('IQEF Intake Form'!J8)","v":0},{"$f":"VALUE('IQEF Intake Form'!K8)","v":1},{"$f":"VALUE('IQEF Intake Form'!L8)","v":0},{"$f":"VALUE('IQEF Intake Form'!M8)","v":0},{"$f":"VALUE('IQEF Intake Form'!N8)","v":0},{"$f":"VALUE('IQEF Intake Form'!O8)","v":0},{"$f":"VALUE('IQEF Intake Form'!P8)","v":{"$error":"#DIV/0!"}},{"$f":"VALUE('IQEF Intake Form'!Q8)","v":0},{"$f":"VALUE('IQEF Intake Form'!R8)","v":0},{"$f":"VALUE('IQEF Intake Form'!S8)","v":0},{"$f":"VALUE('IQEF Intake Form'!T8)","v":0},{"$f":"VALUE('IQEF Intake Form'!U8)","v":0},{"$f":"VALUE('IQEF Intake Form'!V8)","v":0},{"$f":"VALUE('IQEF Intake Form'!W8)","v":0}]
[{"$f":"VALUE('IQEF Intake Form'!F9)","v":0},{"$f":"VALUE('IQEF Intake Form'!G9)","v":0},{"$f":"VALUE('IQEF Intake Form'!H9)","v":{"$error":"#VALUE!"}},{"$f":"VALUE('IQEF Intake Form'!I9)","v":0},{"$f":"VALUE('IQEF Intake Form'!J9)","v":0},{"$f":"VALUE('IQEF Intake Form'!K9)","v":1},{"$f":"VALUE('IQEF Intake Form'!L9)","v":0},{"$f":"VALUE('IQEF Intake Form'!M9)","v":0},{"$f":"VALUE('IQEF Intake Form'!N9)","v":0},{"$f":"VALUE('IQEF Intake Form'!O9)","v":0},{"$f":"VALUE('IQEF Intake Form'!P9)","v":{"$error":"#DIV/0!"}},{"$f":"VALUE('IQEF Intake Form'!Q9)","v":0},{"$f":"VALUE('IQEF Intake Form'!R9)","v":0},{"$f":"VALUE('IQEF Intake Form'!S9)","v":0},{"$f":"VALUE('IQEF Intake Form'!T9)","v":0},{"$f":"VALUE('IQEF Intake Form'!U9)","v":0},{"$f":"VALUE('IQEF Intake Form'!V9)","v":0},{"$f":"VALUE('IQEF Intake Form'!W9)","v":0}]
[{"$f":"VALUE('IQEF Intake Form'!F10)","v":0},{"$f":"VALUE('IQEF Intake Form'!G10)","v":0},{"$f":"VALUE('IQEF Intake Form'!H10)","v":{"$error":"#VALUE!"}},{"$f":"VALUE('IQEF Intake Form'!I10)","v":0},{"$f":"VALUE('IQEF Intake Form'!J10)","v":0},{"$f":"VALUE('IQEF Intake Form'!K10)","v":1},{"$f":"VALUE('IQEF Intake Form'!L10)","v":0},{"$f":"VALUE('IQEF Intake Form'!M10)","v":0},{"$f":"VALUE('IQEF Intake Form'!N10)","v":0},{"$f":"VALUE('IQEF Intake Form'!O10)","v":0},{"$f":"VALUE('IQEF Intake Form'!P10)","v":{"$error":"#DIV/0!"}},{"$f":"VALUE('IQEF Intake Form'!Q10)","v":0},{"$f":"VALUE('IQEF Intake Form'!R10)","v":0},{"$f":"VALUE('IQEF Intake Form'!S10)","v":0},{"$f":"VALUE('IQEF Intake Form'!T10)","v":0},{"$f":"VALUE('IQEF Intake Form'!U10)","v":0},{"$f":"VALUE('IQEF Intake Form'!V10)","v":0},{"$f":"VALUE('IQEF Intake Form'!W10)","v":0}]
[{"$f":"VALUE('IQEF Intake Form'!F11)","v":0},{"$f":"VALUE('IQEF Intake Form'!G11)","v":0},{"$f":"VALUE('IQEF Intake Form'!H11)","v":{"$error":"#VALUE!"}},{"$f":"VALUE('IQEF Intake Form'!I11)","v":0},{"$f":"VALUE('IQEF Intake Form'!J11)","v":0},{"$f":"VALUE('IQEF Intake Form'!K11)","v":1},{"$f":"VALUE('IQEF Intake Form'!L11)","v":0},{"$f":"VALUE('IQEF Intake Form'!M11)","v":0},{"$f":"VALUE('IQEF Intake Form'!N11)","v":0},{"$f":"VALUE('IQEF Intake Form'!O11)","v":0},{"$f":"VALUE('IQEF Intake Form'!P11)","v":{"$error":"#DIV/0!"}},{"$f":"VALUE('IQEF Intake Form'!Q11)","v":0},{"$f":"VALUE('IQEF Intake Form'!R11)","v":0},{"$f":"VALUE('IQEF Intake Form'!S11)","v":0},{"$f":"VALUE('IQEF Intake Form'!T11)","v":0},{"$f":"VALUE('IQEF Intake Form'!U11)","v":0},{"$f":"VALUE('IQEF Intake Form'!V11)","v":0},{"$f":"VALUE('IQEF Intake Form'!W11)","v":0}]
[{"$f":"VALUE('IQEF Intake Form'!F12)","v":0},{"$f":"VALUE('IQEF Intake Form'!G12)","v":0},{"$f":"VALUE('IQEF Intake Form'!H12)","v":{"$error":"#VALUE!"}},{"$f":"VALUE('IQEF Intake Form'!I12)","v":0},{"$f":"VALUE('IQEF Intake Form'!J12)","v":0},{"$f":"VALUE('IQEF Intake Form'!K12)","v":1},{"$f":"VALUE('IQEF Intake Form'!L12)","v":0},{"$f":"VALUE('IQEF Intake Form'!M12)","v":0},{"$f":"VALUE('IQEF Intake Form'!N12)","v":0},{"$f":"VALUE('IQEF Intake Form'!O12)","v":0},{"$f":"VALUE('IQEF Intake Form'!P12)","v":{"$error":"#DIV/0!"}},{"$f":"VALUE('IQEF Intake Form'!Q12)","v":0},{"$f":"VALUE('IQEF Intake Form'!R12)","v":0},{"$f":"VALUE('IQEF Intake Form'!S12)","v":0},{"$f":"VALUE('IQEF Intake Form'!T12)","v":0},{"$f":"VALUE('IQEF Intake Form'!U12)","v":0},{"$f":"VALUE('IQEF Intake Form'!V12)","v":0},{"$f":"VALUE('IQEF Intake Form'!W12)","v":0}]
{"$rows_left_out":117}
{"sheet":"Copy Values","index":3,"n_rows":97,"n_cols":12,"rows_kept":97,"cut":false,"hidden":true,"merged":[]}
["TOTALS\nlighting (first line) and all other (second line)\n",null,null,null,null,null,"Project Savings and Screening Performance, TOTALS\n"]
[{"$f":"SUM(A5:A24)","v":0},{"$f":"SUM(B5:B24)","v":0},0,0,0,0,"kWh","kW","Peak kW","MMBtu","NPV","TRB"]
[{"$f":"SUM(A27:A31,A34:A36,A39,A42,A46:A48,A52:A54,A57,A62:A64,A68:A71,A74:A75,A79:A84,A89:A91,A96:A97)","v":0},0,0,0,0,0,{"$f":"SUM(G5:G24,G27:G31,G34:G36,G39,G42,G46:G48,G52:G54,G57,G62:G64,G68:G71,G74:G75,G79:G84,G89:G91,G96:G97)","v":{"$error":"#VALUE!"}},{"$f":"SUM(H5:H24,H27:H31,H34:H36,H39,H42,H46:H48,H52:H54,H57,H62:H64,H68:H71,H74:H75,H79:H84,H89:H91,H96:H97)","v":{"$error":"#N/A"}},{"$error":"#REF!"},{"$error":"#N/A"},{"$error":"#REF!"},{"$error":"#REF!"}]
[{"$f":"IFERROR(G4,0)","v":"kWh"},{"$f":"IFERROR(H4,0)","v":"kW"},{"$f":"IFERROR(I4,0)","v":0},{"$f":"IFERROR(J4,0)","v":"MMBtu"},{"$f":"IFERROR(K4,0)","v":0},{"$f":"IFERROR(L4,0)","v":0},{"$f":"'Project Performance'!A4","v":"kWh"},{"$f":"'Project Performance'!B4","v":"kW"},{"$f":"'Project Performance'!#REF!","v":{"$error":"#REF!"}},{"$f":"'Project Performance'!C4","v":"MMBtu"},{"$f":"'Project Performance'!#REF!","v":{"$error":"#REF!"}},{"$f":"'Project Performance'!#REF!","v":{"$error":"#REF!"}}]
[0,0,0,0,0,0,{"$f":"'Project Performance'!A5","v":{"$error":"#VALUE!"}},{"$f":"'Project Performance'!B5","v":{"$error":"#N/A"}},{"$f":"'Project Performance'!#REF!","v":{"$error":"#REF!"}},{"$f":"'Project Performance'!C5","v":0},{"$f":"'Project Performance'!#REF!","v":{"$error":"#REF!"}},{"$f":"'Project Performance'!#REF!","v":{"$error":"#REF!"}}]
[0,0,0,0,0,0,{"$f":"'Project Performance'!A6","v":{"$error":"#VALUE!"}},{"$f":"'Project Performance'!B6","v":{"$error":"#N/A"}},{"$f":"'Project Performance'!#REF!","v":{"$error":"#REF!"}},{"$f":"'Project Performance'!C6","v":0},{"$f":"'Project Performance'!#REF!","v":{"$error":"#REF!"}},{"$f":"'Project Performance'!#REF!","v":{"$error":"#REF!"}}]
[0,0,0,0,0,0,{"$f":"'Project Performance'!A7","v":{"$error":"#VALUE!"}},{"$f":"'Project Performance'!B7","v":{"$error":"#N/A"}},{"$f":"'Project Performance'!#REF!","v":{"$error":"#REF!"}},{"$f":"'Project Performance'!C7","v":0},{"$f":"'Project Performance'!#REF!","v":{"$error":"#REF!"}},{"$f":"'Project Performance'!#REF!","v":{"$error":"#REF!"}}]
[0,0,0,0,0,0,{"$f":"'Project Performance'!A8","v":{"$error":"#VALUE!"}},{"$f":"'Project Performance'!B8","v":{"$error":"#N/A"}},{"$f":"'Project Performance'!#REF!","v":{"$error":"#REF!"}},{"$f":"'Project Performance'!C8","v":0},{"$f":"'Project Performance'!#REF!","v":{"$error":"#REF!"}},{"$f":"'Project Performance'!#REF!","v":{"$error":"#REF!"}}]
[0,0,0,0,0,0,{"$f":"'Project Performance'!A9","v":{"$error":"#VALUE!"}},{"$f":"'Project Performance'!B9","v":{"$error":"#N/A"}},{"$f":"'Project Performance'!#REF!","v":{"$error":"#REF!"}},{"$f":"'Project Performance'!C9","v":0},{"$f":"'Project Performance'!#REF!","v":{"$error":"#REF!"}},{"$f":"'Project Performance'!#REF!","v":{"$error":"#REF!"}}]
[0,0,0,0,0,0,{"$f":"'Project Performance'!A10","v":{"$error":"#VALUE!"}},{"$f":"'Project Performance'!B10","v":{"$error":"#N/A"}},{"$f":"'Project Performance'!#REF!","v":{"$error":"#REF!"}},{"$f":"'Project Performance'!C10","v":0},{"$f":"'Project Performance'!#REF!","v":{"$error":"#REF!"}},{"$f":"'Project Performance'!#REF!","v":{"$error":"#REF!"}}]
{"$rows_left_out":88}
{"sheet":"Project Performance","index":4,"n_rows":90,"n_cols":27,"rows_kept":90,"cut":false,"hidden":true,"merged":[]}
[]
[{"$f":"'Paste Values'!A3","v":{"$error":"#VALUE!"}}]
[{"$f":"'Paste Values'!A4","v":{"$error":"#VALUE!"}}]
["kWh","kW","MMBtu"]
[{"$f":"('Paste Values'!D5*'Paste Values'!G5-'Paste Values'!E5*'Paste Values'!H5)/1000*'Paste Values'!C5*VLOOKUP('Paste Values'!J5,waste_heat,3,FALSE)","v":{"$error":"#VALUE!"}},{"$f":"('Paste Values'!D5*'Paste Values'!G5-'Paste Values'!E5*'Paste Values'!H5)/1000*VLOOKUP('Paste Values'!J5,waste_heat,4,FALSE)","v":{"$error":"#N/A"}},null,{"$f":"-('Paste Values'!E5*'Paste Values'!H5-'Paste Values'!F5*'Paste Values'!I5)/1000*'Paste Values'!D5*(1-0.25)*0.7*0.23*0.95/0.75*0.68*0.003412","v":0}]
[{"$f":"('Paste Values'!D6*'Paste Values'!G6-'Paste Values'!E6*'Paste Values'!H6)/1000*'Paste Values'!C6*VLOOKUP('Paste Values'!J6,waste_heat,3,FALSE)","v":{"$error":"#VALUE!"}},{"$f":"('Paste Values'!D6*'Paste Values'!G6-'Paste Values'!E6*'Paste Values'!H6)/1000*VLOOKUP('Paste Values'!J6,waste_heat,4,FALSE)","v":{"$error":"#N/A"}},null,{"$f":"-('Paste Values'!E6*'Paste Values'!H6-'Paste Values'!F6*'Paste Values'!I6)/1000*'Paste Values'!D6*(1-0.25)*0.7*0.23*0.95/0.75*0.68*0.003412","v":0},null,null,null,null,null,null,null,null,null,null,null,null,null,null,null,{"$f":"\" ((WattsBASE – WattsEE ) / 1000) × HOURS × ISR × (WHFeHeat + (WHFeCool - 1))\"","v":" ((WattsBASE – WattsEE ) / 1000) × HOURS × ISR × (WHFeHeat + (WHFeCool - 1))"}]
[{"$f":"('Paste Values'!D7*'Paste Values'!G7-'Paste Values'!E7*'Paste Values'!H7)/1000*'Paste Values'!C7*VLOOKUP('Paste Values'!J7,waste_heat,3,FALSE)","v":{"$error":"#VALUE!"}},{"$f":"('Paste Values'!D7*'Paste Values'!G7-'Paste Values'!E7*'Paste Values'!H7)/1000*VLOOKUP('Paste Values'!J7,waste_heat,4,FALSE)","v":{"$error":"#N/A"}},null,{"$f":"-('Paste Values'!E7*'Paste Values'!H7-'Paste Values'!F7*'Paste Values'!I7)/1000*'Paste Values'!D7*(1-0.25)*0.7*0.23*0.95/0.75*0.68*0.003412","v":0},null,null,null,null,null,null,null,null,null,null,null,null,null,null,null,null,null,null,null,0.98699999999999999,"interior",1.107,"interior"]
[{"$f":"('Paste Values'!D8*'Paste Values'!G8-'Paste Values'!E8*'Paste Values'!H8)/1000*'Paste Values'!C8*VLOOKUP('Paste Values'!J8,waste_heat,3,FALSE)","v":{"$error":"#VALUE!"}},{"$f":"('Paste Values'!D8*'Paste Values'!G8-'Paste Values'!E8*'Paste Values'!H8)/1000*VLOOKUP('Paste Values'!J8,waste_heat,4,FALSE)","v":{"$error":"#N/A"}},null,{"$f":"-('Paste Values'!E8*'Paste Values'!H8-'Paste Values'!F8*'Paste Values'!I8)/1000*'Paste Values'!D8*(1-0.25)*0.7*0.23*0.95/0.75*0.68*0.003412","v":0},null,null,null,null,null,null,null,null,null,null,null,null,null,null,null,null,null,null,null,1,"exterior",1,"exterior"]
[{"$f":"('Paste Values'!D9*'Paste Values'!G9-'Paste Values'!E9*'Paste Values'!H9)/1000*'Paste Values'!C9*VLOOKUP('Paste Values'!J9,waste_heat,3,FALSE)","v":{"$error":"#VALUE!"}},{"$f":"('Paste Values'!D9*'Paste Values'!G9-'Paste Values'!E9*'Paste Values'!H9)/1000*VLOOKUP('Paste Values'!J9,waste_heat,4,FALSE)","v":{"$error":"#N/A"}},null,{"$f":"-('Paste Values'!E9*'Paste Values'!H9-'Paste Values'!F9*'Paste Values'!I9)/1000*'Paste Values'!D9*(1-0.25)*0.7*0.23*0.95/0.75*0.68*0.003412","v":0},null,null,null,null,null,null,null,null,null,null,null,null,null,null,null,null,null,"Lighting Waste Heat Lookup"]
[{"$f":"('Paste Values'!D10*'Paste Values'!G10-'Paste Values'!E10*'Paste Values'!H10)/1000*'Paste Values'!C10*VLOOKUP('Paste Values'!J10,waste_heat,3,FALSE)","v":{"$error":"#VALUE!"}},{"$f":"('Paste Values'!D10*'Paste Values'!G10-'Paste Values'!E10*'Paste Values'!H10)/1000*VLOOKUP('Paste Values'!J10,waste_heat,4,FALSE)","v":{"$error":"#N/A"}},null,{"$f":"-('Paste Values'!E10*'Paste Values'!H10-'Paste Values'!F10*'Paste Values'!I10)/1000*'Paste Values'!D10*(1-0.25)*0.7*0.23*0.95/0.75*0.68*0.003412","v":0},null,null,null,null,null,null,null,null,null,null,null,null,null,null,null,null,null,null,null,"energy","demand"]
{"$rows_left_out":80}